FreeM Logo

 

All Builds

Build log.

Tru64 UNIX 5.1B

alpha
philotes
BUILD COMMAND:   make
PLATFORM:        OSF1 philotes.coherent-logic.com V5.1 2650 alpha
FREEM VERSION:   0.44.0
BUILD DATE:      Sat Oct  2 15:48:48 MST 2021

Making all in src
make[1]: Entering directory `/var/nas/freem-build/philotes/freem/src'
cd .. && /bin/ksh ./config.status src/config.h
config.status: creating src/config.h
config.status: src/config.h is unchanged
make  all-am
make[2]: Entering directory `/var/nas/freem-build/philotes/freem/src'
gcc -DHAVE_CONFIG_H -I.  -DHACK_NOXLATE -DSYSCONFDIR=\"/usr/local/etc\" -DPREFIX=\"/usr/local\" -DDATADIR=\"/usr/local/share\" -DLOCALSTATEDIR=\"/usr/local/var\" -DHOST=\"alphaev68-dec-osf5.1b\"  -fsigned-char  -g -O2 -MT freem-mumps.o -MD -MP -MF .deps/freem-mumps.Tpo -c -o freem-mumps.o `test -f 'mumps.c' || echo './'`mumps.c
mv -f .deps/freem-mumps.Tpo .deps/freem-mumps.Po
gcc -DHAVE_CONFIG_H -I.  -DHACK_NOXLATE -DSYSCONFDIR=\"/usr/local/etc\" -DPREFIX=\"/usr/local\" -DDATADIR=\"/usr/local/share\" -DLOCALSTATEDIR=\"/usr/local/var\" -DHOST=\"alphaev68-dec-osf5.1b\"  -fsigned-char  -g -O2 -MT freem-iniconf.o -MD -MP -MF .deps/freem-iniconf.Tpo -c -o freem-iniconf.o `test -f 'iniconf.c' || echo './'`iniconf.c
mv -f .deps/freem-iniconf.Tpo .deps/freem-iniconf.Po
gcc -DHAVE_CONFIG_H -I.  -DHACK_NOXLATE -DSYSCONFDIR=\"/usr/local/etc\" -DPREFIX=\"/usr/local\" -DDATADIR=\"/usr/local/share\" -DLOCALSTATEDIR=\"/usr/local/var\" -DHOST=\"alphaev68-dec-osf5.1b\"  -fsigned-char  -g -O2 -MT freem-sighnd.o -MD -MP -MF .deps/freem-sighnd.Tpo -c -o freem-sighnd.o `test -f 'sighnd.c' || echo './'`sighnd.c
mv -f .deps/freem-sighnd.Tpo .deps/freem-sighnd.Po
gcc -DHAVE_CONFIG_H -I.  -DHACK_NOXLATE -DSYSCONFDIR=\"/usr/local/etc\" -DPREFIX=\"/usr/local\" -DDATADIR=\"/usr/local/share\" -DLOCALSTATEDIR=\"/usr/local/var\" -DHOST=\"alphaev68-dec-osf5.1b\"  -fsigned-char  -g -O2 -MT freem-init.o -MD -MP -MF .deps/freem-init.Tpo -c -o freem-init.o `test -f 'init.c' || echo './'`init.c
init.c: In function 'init_timezone':
init.c:315: warning: passing argument 1 of 'localtime' from incompatible pointer type
/usr/include/time.h:118: note: expected 'const time_t *' but argument is of type 'long int *'
init.c:316: warning: passing argument 1 of 'gmtime' from incompatible pointer type
/usr/include/time.h:117: note: expected 'const time_t *' but argument is of type 'long int *'
mv -f .deps/freem-init.Tpo .deps/freem-init.Po
gcc -DHAVE_CONFIG_H -I.  -DHACK_NOXLATE -DSYSCONFDIR=\"/usr/local/etc\" -DPREFIX=\"/usr/local\" -DDATADIR=\"/usr/local/share\" -DLOCALSTATEDIR=\"/usr/local/var\" -DHOST=\"alphaev68-dec-osf5.1b\"  -fsigned-char  -g -O2 -MT freem-expr.o -MD -MP -MF .deps/freem-expr.Tpo -c -o freem-expr.o `test -f 'expr.c' || echo './'`expr.c

cc1: out of memory allocating 4072 bytes after a total of 25768256 bytes
make[2]: *** [freem-expr.o] Error 1
make[2]: Leaving directory `/var/nas/freem-build/philotes/freem/src'
make[1]: *** [all] Error 2
make[1]: Leaving directory `/var/nas/freem-build/philotes/freem/src'
make: *** [all-recursive] Error 1